Jump to content
  • 0

Build Failure


Rummil
 Share

Question

I am setting up a new server and I am getting this error:
( I am not sure how to troubleshoot this) 

[Pterodactyl Daemon]: Checking server disk space usage, this could take a few seconds...
[Pterodactyl Daemon]: Updating process configuration files...
[Pterodactyl Daemon]: Ensuring file permissions are set correctly, this could take a few seconds...
[email protected]~ Server marked as starting...
[Pterodactyl Daemon]: Pulling Docker container image, this could take a few minutes to complete...
[Pterodactyl Daemon]: Finished pulling Docker container image
WARNING: An illegal reflective access operation has occurred
WARNING: Illegal reflective access by com.google.inject.internal.cglib.core.$ReflectUtils$1 (file:/usr/share/maven/lib/guice.jar) to method java.lang.ClassLoader.defineClass(java.lang.String,byte[],int,int,java.security.ProtectionDomain)
WARNING: Please consider reporting this to the maintainers of com.google.inject.internal.cglib.core.$ReflectUtils$1
WARNING: Use --illegal-access=warn to enable warnings of further illegal reflective access operations
[email protected]~ Server marked as running...
WARNING: All illegal access operations will be denied in a future release
[INFO] Scanning for projects...
[INFO] ------------------------------------------------------------------------
[INFO] BUILD FAILURE
[INFO] ------------------------------------------------------------------------
[INFO] Total time:  1.294 s
[INFO] Finished at: 2022-06-27T21:56:47-04:00
[INFO] ------------------------------------------------------------------------
[ERROR] The goal you specified requires a project to execute but there is no POM in this directory (/home/container). Please verify you invoked Maven from the correct directory. -> [Help 1]
[ERROR] 
[ERROR] To see the full stack trace of the errors, re-run Maven with the -e switch.
[ERROR] Re-run Maven using the -X switch to enable full debug logging.
[ERROR] 
[ERROR] For more information about the errors and possible solutions, please read the following articles:
[ERROR] [Help 1] http://cwiki.apache.org/confluence/display/MAVEN/MissingProjectException
Error: Unable to access jarfile main.jar
[email protected]~ Server marked as offline...
[Pterodactyl Daemon]: ---------- Detected server process in a crashed state! ----------
[Pterodactyl Daemon]: Exit code: 1
[Pterodactyl Daemon]: Out of memory: false
[Pterodactyl Daemon]: Checking server disk space usage, this could take a few seconds...
[Pterodactyl Daemon]: Updating process configuration files...
[Pterodactyl Daemon]: Ensuring file permissions are set correctly, this could take a few seconds...
[email protected]~ Server marked as starting...
[Pterodactyl Daemon]: Pulling Docker container image, this could take a few minutes to complete...
[Pterodactyl Daemon]: Finished pulling Docker container image
WARNING: An illegal reflective access operation has occurred
WARNING: Illegal reflective access by com.google.inject.internal.cglib.core.$ReflectUtils$1 (file:/usr/share/maven/lib/guice.jar) to method java.lang.ClassLoader.defineClass(java.lang.String,byte[],int,int,java.security.ProtectionDomain)
WARNING: Please consider reporting this to the maintainers of com.google.inject.internal.cglib.core.$ReflectUtils$1
[email protected]~ Server marked as running...
WARNING: Use --illegal-access=warn to enable warnings of further illegal reflective access operations
WARNING: All illegal access operations will be denied in a future release
[INFO] Scanning for projects...
[INFO] ------------------------------------------------------------------------
[INFO] BUILD FAILURE
[INFO] ------------------------------------------------------------------------
[INFO] Total time:  1.103 s
[INFO] Finished at: 2022-06-27T21:57:08-04:00
[INFO] ------------------------------------------------------------------------
[ERROR] The goal you specified requires a project to execute but there is no POM in this directory (/home/container). Please verify you invoked Maven from the correct directory. -> [Help 1]
[ERROR] 
[ERROR] To see the full stack trace of the errors, re-run Maven with the -e switch.
[ERROR] Re-run Maven using the -X switch to enable full debug logging.
[ERROR] 
[ERROR] For more information about the errors and possible solutions, please read the following articles:
[ERROR] [Help 1] http://cwiki.apache.org/confluence/display/MAVEN/MissingProjectException
Error: Unable to access jarfile main.jar
[email protected]~ Server marked as offline...
[Pterodactyl Daemon]: ---------- Detected server process in a crashed state! ----------
[Pterodactyl Daemon]: Exit code: 1
[Pterodactyl Daemon]: Out of memory: false
[Pterodactyl Daemon]: Aborting automatic restart, last crash occurred less than 60 seconds ago.

Link to comment
Share on other sites

0 answers to this question

Recommended Posts

There have been no answers to this question yet

Create an account or sign in to comment

You need to be a member in order to leave a comment

Create an account

Sign up for a new account in our community. It's easy!

Register a new account

Sign in

Already have an account? Sign in here.

Sign In Now
 Share

392.4k

Downloads

Total number of downloads.

2.1k

Customers

Total customers served.

28.3k

Files Sold

Total number of files sold.

441.8k

Payments Processed

Total payments processed.

×
×
  • Create New...

Important Information

We have placed cookies on your device to help make this website better. You can adjust your cookie settings, otherwise we'll assume you're okay to continue.